{"text_format":"1","workbook":"xlsx","n_sheets":8,"sheets":["A_MenuPrincipal","WksDemo","CouleursDeCellules","DeplacementSelection","Evaluation","FeuilleDeProprietes","TauxEuro","BaseDeDonnees"],"not_rendered":{"charts":0,"images":4,"macros":1,"external_links":0,"defined_names":13,"comments":1,"pivot_tables":0},"unopened":[],"bounds":{"document_bytes":16777216,"sheet_cells":100000,"rows_first":2000,"rows_last":500,"rows_between":2000,"halvings":0,"cell_chars":16384,"cell_head_chars":4096},"cells_cut":0,"cells_raw":0,"read":"whole","date_system":"1900"}

{"sheet":"A_MenuPrincipal","index":0,"n_rows":0,"n_cols":0,"rows_kept":0,"cut":false,"hidden":false,"merged":[]}

{"sheet":"WksDemo","index":1,"n_rows":6,"n_cols":2,"rows_kept":6,"cut":false,"hidden":false,"merged":[]}
[]
[]
[null,"Cliquez sur l'icone pour sélectionner un fichier et rapatrier ses informations"]
[null,"Bidon.xlsm"]
[null,"D:\\Downloads\\"]
[null,"D:\\Downloads\\Bidon.xlsm"]

{"sheet":"CouleursDeCellules","index":2,"n_rows":11,"n_cols":17,"rows_kept":11,"cut":false,"hidden":false,"merged":[]}
[]
[]
[null,{"$f":"RANDBETWEEN(1,10000)","v":9508},788,1575,9848,8431,8576,1139,4704,5351,9236,7032,2423,3207,9242,8582,5353]
[null,2730,6417,1789,994,2228,8438,4477,3889,2642,5340,4275,3973,8050,2383,2253,6960]
[null,1461,8718,5279,5911,7873,8536,6397,3953,9503,7992,5908,8453,4541,8923,682,88]
[null,6409,8733,5615,9931,8048,6758,111,318,6425,9959,4200,4226,7522,4856,4751,2066]
[null,6202,5333,1259,7062,1018,1899,2567,5638,8755,7508,7406,4103,6969,350,825,7788]
[null,6254,3415,8082,3785,8054,2453,692,677,5219,2539,4159,7572,3425,8831,3241,2947]
[null,6500,2320,4500,1871,2895,4854,8522,4002,2756,8071,1086,8011,9376,5869,8416,2221]
[null,4820,8488,5221,4923,3910,1098,2529,1342,3525,2339,8127,3548,3410,6832,4421,1373]
[null,9298,7773,988,4595,6985,2478,1208,4766,3205,5140,486,3615,9930,6830,7902,9301]

{"sheet":"DeplacementSelection","index":3,"n_rows":6,"n_cols":4,"rows_kept":6,"cut":false,"hidden":false,"merged":[]}
["Kiki","Kiki","Kiki","Kiki"]
["Kiki","Kiki","Kiki","Kiki"]
["Kiki","Kiki","Kiki","Kiki"]
["Kiki","Kiki","Kiki","Kiki"]
["Kiki","Kiki","Kiki","Kiki"]
["Kiki","Kiki","Kiki","Kiki"]

{"sheet":"Evaluation","index":4,"n_rows":6,"n_cols":4,"rows_kept":6,"cut":false,"hidden":false,"merged":[]}
["Nom","Prénom","Title"]
["DEVEAUX","Daniel",12.5]
["DE KIMPE","Erika",24,"Daniel DEVEAUX"]
["DELANAY","Amaryllis",10]
["JASSOGNE","Damien",28]
["EINSTEIN","Albert",14]

{"sheet":"FeuilleDeProprietes","index":5,"n_rows":0,"n_cols":0,"rows_kept":0,"cut":false,"hidden":false,"merged":[]}

{"sheet":"TauxEuro","index":6,"n_rows":0,"n_cols":0,"rows_kept":0,"cut":false,"hidden":false,"merged":[]}

{"sheet":"BaseDeDonnees","index":7,"n_rows":128,"n_cols":16,"rows_kept":128,"cut":false,"hidden":false,"merged":[]}
["NAME","FIRST NAME","Country","Club","Sex","Birthday","Age","Category","Score max=3800","Score1 max=100","COMMENTS","Score max=1500","Score2 max=100","COMMENTS2","AVERAGE SCORE max=100","DECISION"]
["AGE","Marie","Belgium","Atleco","F","1997-11-14",{"$f":"YEAR(TODAY()-F2)-1900","v":20},{"$f":"IF(G2<18,\"Junior\",\"Senior\")","v":"Senior"},3590,{"$f":"I2/38","v":94.473684210526315},{"$f":"IF(AND(J2>=80,H2=\"Junior\"),\"High Potential\",IF(AND(J2>=60,H2=\"Senior\"),\"OK\",IF(J2>=60,\"More training needed\",\"To be improved\")))","v":"OK"},1208,{"$f":"L2/15","v":80.533333333333331},{"$f":"IF(AND(M2>=80,H2=\"Junior\"),\"High Potential\",IF(AND(M2>=60,H2=\"Senior\"),\"OK\",IF(M2>=60,\"More training needed\",\"To be improved\")))","v":"OK"},{"$f":"(M2+J2)/2","v":87.50350877192983},{"$f":"IF(AND(J2>=60,M2>=60),\"Accepted\",IF(M2>J2,\"New test needed\",\"Not accepted\"))","v":"Accepted"}]
["ALGRAIN","Michel","Belgium","Atleco","M","1999-10-31",18,"Senior",2432,64,"OK",870,58,"To be improved",61,"Not accepted"]
["ALLER-LOPEZ","Miguel","Spain","Asturial","M","1991-08-13",26,"Senior",2512,66.10526315789474,"OK",780,52,"To be improved",59.05263157894737,"Not accepted"]
["ANDCLYDE","Bonnie","Netherlands","Extrasportief","F","1998-07-25",20,"Senior",2140,56.315789473684212,"To be improved",1001,66.733333333333334,"OK",61.52456140350877,"New test needed"]
["ARICKX","Josiane","France","Olympic","F","1992-11-07",25,"Senior",2154,56.684210526315788,"To be improved",520,34.666666666666664,"To be improved",45.675438596491226,"Not accepted"]
["ATTEND","Charles","Belgium","Atleco","M","1996-11-06",21,"Senior",2784,73.263157894736835,"OK",988,65.86666666666666,"OK",69.564912280701748,"Accepted"]
["AUGRANDPIED","Berthe","Switzerland","Sporteo","F","1991-01-21",27,"Senior",3601,94.763157894736835,"OK",1223,81.533333333333331,"OK",88.148245614035091,"Accepted"]
["BELGUENANI","Mimoun","Algeria","Raja","M","1993-04-04",25,"Senior",1941,51.078947368421055,"To be improved",915,61,"OK",56.039473684210527,"New test needed"]
["BEN SLIMANE","Jamal","Algeria","Raja","M","1994-02-13",24,"Senior",2154,56.684210526315788,"To be improved",1200,80,"OK",68.34210526315789,"New test needed"]
["BENTHAMI-KHIBI","Hafida","Algeria","Raja","F","1993-11-01",24,"Senior",2897,76.236842105263165,"OK",897,59.8,"To be improved",68.018421052631581,"Not accepted"]
["BERWETTE","Andrée","Switzerland","Sporteo","F","1992-01-06",26,"Senior",2858,75.21052631578948,"OK",858,57.2,"To be improved",66.205263157894734,"Not accepted"]
["BERY","Georges","France","Olympic","M","1991-07-15",27,"Senior",3156,83.05263157894737,"OK",1156,77.066666666666663,"OK",80.059649122807016,"Accepted"]
["BILLEN","Bernard","Belgium","Atleco","M","1991-09-23",26,"Senior",2841,74.763157894736835,"OK",841,56.06666666666667,"To be improved",65.414912280701756,"Not accepted"]
["BOLLE","Maggy","Belgium","Atleco","F","1993-08-09",24,"Senior",2969,78.131578947368425,"OK",343,22.866666666666667,"To be improved",50.499122807017542,"Not accepted"]
["BONNEWYN","Ariane","Belgium","Atleco","F","1998-03-09",20,"Senior",3086,81.21052631578948,"OK",1086,72.400000000000006,"OK",76.805263157894743,"Accepted"]
["BOVY","Michèle","Belgium","Atleco","F","1999-02-12",19,"Senior",1953,51.39473684210526,"To be improved",1280,85.333333333333329,"OK",68.364035087719287,"New test needed"]
["CALATAYUD","Mercedes","Spain","Asturial","F","1993-10-19",24,"Senior",3207,84.39473684210526,"OK",1207,80.466666666666669,"OK",82.430701754385964,"Accepted"]
["CAMBY","Thierry","Switzerland","Sporteo","M","1995-09-07",22,"Senior",2261,59.5,"To be improved",261,17.399999999999999,"To be improved",38.450000000000003,"Not accepted"]
["CARLIER","Luc","Belgium","Atleco","M","1993-12-31",24,"Senior",2420,63.684210526315788,"OK",420,28,"To be improved",45.84210526315789,"Not accepted"]
["CELY","Peter","Netherlands","Extrasportief","M","1993-10-25",24,"Senior",3541,93.184210526315795,"OK",776,51.733333333333334,"To be improved",72.458771929824564,"Not accepted"]
["CINCINATIS","Yves","Belgium","Atleco","M","1995-07-27",23,"Senior",3144,82.736842105263165,"OK",1144,76.266666666666666,"OK",79.501754385964915,"Accepted"]
["CLETTE","Lara","Switzerland","Sporteo","F","1992-10-12",25,"Senior",2813,74.026315789473685,"OK",244,16.266666666666666,"To be improved",45.146491228070175,"Not accepted"]
["COBLANT","Harry","Switzerland","Sporteo","M","1998-02-05",20,"Senior",2153,56.657894736842103,"To be improved",774,51.6,"To be improved",54.128947368421052,"Not accepted"]
["COLOGNE","Aude","Switzerland","Sporteo","F","1994-02-23",24,"Senior",1964,51.684210526315788,"To be improved",224,14.933333333333334,"To be improved",33.308771929824559,"Not accepted"]
["COSSE","Michèle","Switzerland","Sporteo","F","1996-03-12",22,"Senior",2003,52.710526315789473,"To be improved",800,53.333333333333336,"To be improved",53.021929824561404,"New test needed"]
["COVAIR","Harry","Belgium","Atleco","M","1994-10-23",23,"Senior",2998,78.89473684210526,"OK",231,15.4,"To be improved",47.147368421052633,"Not accepted"]
["DAO","Phung Nam","Korea","Sporteo","M","1998-08-15",19,"Senior",3196,84.10526315789474,"OK",1196,79.733333333333334,"OK",81.919298245614044,"Accepted"]
["DE BACKER","Patrick","Belgium","Atleco","M","1993-05-10",25,"Senior",3410,89.736842105263165,"OK",1410,94,"OK",91.868421052631589,"Accepted"]
["de GHELDERE","Jean-Benoît","Switzerland","Sporteo","M","1994-02-05",24,"Senior",3255,85.65789473684211,"OK",1255,83.666666666666671,"OK",84.662280701754383,"Accepted"]
["DE LEEUW","Philippe","Belgium","Atleco","M","1997-11-05",20,"Senior",2535,66.71052631578948,"OK",535,35.666666666666664,"To be improved",51.188596491228068,"Not accepted"]
["DEBAST","Frédéric","Belgium","Atleco","M","1999-11-15",18,"Senior",2547,67.026315789473685,"OK",547,36.466666666666669,"To be improved",51.746491228070177,"Not accepted"]
["DECAMPS","Lucienne","France","Olympic","F","1996-11-15",21,"Senior",3240,85.263157894736835,"OK",1240,82.666666666666671,"OK",83.964912280701753,"Accepted"]
["DEQUENNE","Philippe","Belgium","Atleco","M","1993-09-11",{"$f":"YEAR(TODAY()-F34)-1900","v":24},"Senior",2547,67.026315789473685,"OK",547,36.466666666666669,"To be improved",51.746491228070177,"Not accepted"]
["DETOUSSE","Aimée","France","Olympic","F","1998-06-04",20,"Senior",3732,98.21052631578948,"OK",1272,84.8,"OK",91.505263157894746,"Accepted"]
["DUHOUX","Marc","Switzerland","Sporteo","M","1992-06-18",26,"Senior",2688,70.736842105263165,"OK",688,45.866666666666667,"To be improved",58.301754385964912,"Not accepted"]
["DUMONT","Christophe","Belgium","Atleco","M","1991-08-09",26,"Senior",3219,84.71052631578948,"OK",1219,81.266666666666666,"OK",82.988596491228066,"Accepted"]
["DUPONT","Marie","Belgium","Atleco","F","1997-07-20",21,"Senior",2500,65.78947368421052,"OK",500,33.333333333333336,"To be improved",49.561403508771932,"Not accepted"]
["EAUDURANUS","Anne","Belgium","Atleco","F","1992-12-16",25,"Senior",2289,60.236842105263158,"OK",450,30,"To be improved",45.118421052631575,"Not accepted"]
["EL BARAKA","Mohammed","Morocco","Doukal","M","1997-05-27",21,"Senior",3239,85.236842105263165,"OK",1239,82.6,"OK",83.918421052631572,"Accepted"]
["FONTAINE","Robert","Switzerland","Sporteo","M","1999-09-02",18,"Senior",3156,83.05263157894737,"OK",1156,77.066666666666663,"OK",80.059649122807016,"Accepted"]
["GARCIA Y ARENAS","José","Spain","Asturial","M","1991-10-12",26,"Senior",3133,82.44736842105263,"OK",1133,75.533333333333331,"OK",78.990350877192981,"Accepted"]
["GERGES","Antoinette","France","Olympic","F","1992-04-13",26,"Senior",3145,82.763157894736835,"OK",1145,76.333333333333329,"OK",79.548245614035082,"Accepted"]
["GOUDESEUNE","Marc","Belgium","Atleco","M","1999-01-11",19,"Senior",3238,85.21052631578948,"OK",1238,82.533333333333331,"OK",83.871929824561406,"Accepted"]
["GOZZI","Sergio","Italy","Atletico","M","1997-06-03",21,"Senior",3204,84.315789473684205,"OK",1204,80.266666666666666,"OK",82.291228070175436,"Accepted"]
["GUION","Jean-Luc","Belgium","Atleco","M","1997-12-27",20,"Senior",2886,75.94736842105263,"OK",1200,80,"OK",77.973684210526315,"Accepted"]
["GUZZARDI","Francesca","Italy","Atletico","F","1995-03-30",23,"Senior",2953,77.71052631578948,"OK",953,63.533333333333331,"OK",70.621929824561406,"Accepted"]
["HADIJ","Lahoussine","Algeria","Raja","M","1993-08-17",24,"Senior",2862,75.315789473684205,"OK",862,57.466666666666669,"To be improved",66.39122807017543,"Not accepted"]
["HENRY de GENERET","Louis","France","Olympic","M","1992-01-19",26,"Senior",1980,52.10526315789474,"To be improved",1230,82,"OK",67.05263157894737,"New test needed"]
["HERVERT","Hubert","France","Olympic","M","1999-06-17",19,"Senior",2372,62.421052631578945,"OK",1248,83.2,"OK",72.810526315789474,"Accepted"]
["HONETTE","Marie","Belgium","Atleco","F","1997-04-25",21,"Senior",3505,92.236842105263165,"OK",711,47.4,"To be improved",69.818421052631578,"Not accepted"]
["HUSSIN","Louis","France","Olympic","M","1996-11-01",21,"Senior",2412,63.473684210526315,"OK",1430,95.333333333333329,"OK",79.403508771929822,"Accepted"]
["JANSSENS","Paul","Netherlands","Extrasportief","M","1999-04-16",19,"Senior",3398,89.421052631578945,"OK",1398,93.2,"OK",91.310526315789474,"Accepted"]
["JANSSENS","Ed","Netherlands","Extrasportief","M","1994-04-11",24,"Senior",2097,55.184210526315788,"To be improved",1200,80,"OK",67.59210526315789,"New test needed"]
["KINNAER","Thierry","Belgium","Atleco","M","1994-03-06",24,"Senior",2965,78.026315789473685,"OK",1400,93.333333333333329,"OK",85.679824561403507,"Accepted"]
["KOC","Ali","Morocco","Doukal","M","1998-01-22",20,"Senior",2876,75.684210526315795,"OK",870,58,"To be improved",66.84210526315789,"Not accepted"]
["LESSIRE","Jeanne","Belgium","Atleco","F","1998-12-26",19,"Senior",1941,51.078947368421055,"To be improved",920,61.333333333333336,"OK",56.206140350877192,"New test needed"]
["LUQUE RODRIGEZ","Enrique","Spain","Asturial","M","1999-12-19",18,"Senior",3063,80.60526315789474,"OK",1063,70.86666666666666,"OK",75.735964912280707,"Accepted"]
["MAGNE","Charles","Switzerland","Sporteo","M","1993-03-08",25,"Senior",1972,51.89473684210526,"To be improved",644,42.93333333333333,"To be improved",47.414035087719299,"Not accepted"]
["MAHAR","Hadja","Algeria","Raja","F","1991-07-12",27,"Senior",2749,72.34210526315789,"OK",1114,74.266666666666666,"OK",73.304385964912285,"Accepted"]
["MAHY","Jean-Marc","Switzerland","Sporteo","M","1996-10-27",21,"Senior",3121,82.131578947368425,"OK",1121,74.733333333333334,"OK",78.43245614035088,"Accepted"]
["MANFROY","Gérard","Belgium","Atleco","M","1992-06-27",26,"Senior",2674,70.368421052631575,"OK",493,32.866666666666667,"To be improved",51.617543859649118,"Not accepted"]
["MARIN PEREZ","Rafael","Spain","Asturial","M","1994-08-01",23,"Senior",3251,85.55263157894737,"OK",1251,83.4,"OK",84.476315789473688,"Accepted"]
["MAROT","Bernard","Switzerland","Sporteo","M","1993-06-13",25,"Senior",2536,66.736842105263165,"OK",536,35.733333333333334,"To be improved",51.235087719298249,"Not accepted"]
["MARTINEZ GREVESSE","Arturo","Italy","Atletico","M","1994-11-19",23,"Senior",2964,78,"OK",964,64.266666666666666,"OK",71.133333333333326,"Accepted"]
["MARTINEZ GREVESSE","Emilio","Italy","Atletico","M","1994-12-08",{"$f":"YEAR(TODAY()-F66)-1900","v":23},{"$f":"IF(G66<18,\"Junior\",\"Senior\")","v":"Senior"},2524,{"$f":"I66/38","v":66.421052631578945},{"$f":"IF(AND(J66>=80,H66=\"Junior\"),\"High Potential\",IF(AND(J66>=60,H66=\"Senior\"),\"OK\",IF(J66>=60,\"More training needed\",\"To be improved\")))","v":"OK"},524,{"$f":"L66/15","v":34.93333333333333},{"$f":"IF(AND(M66>=80,H66=\"Junior\"),\"High Potential\",IF(AND(M66>=60,H66=\"Senior\"),\"OK\",IF(M66>=60,\"More training needed\",\"To be improved\")))","v":"To be improved"},{"$f":"(M66+J66)/2","v":50.677192982456134},{"$f":"IF(AND(J66>=60,M66>=60),\"Accepted\",IF(M66>J66,\"New test needed\",\"Not accepted\"))","v":"Not accepted"}]
["MARZOUKI","Mohamed","Algeria","Raja","M","1998-11-28",19,"Senior",2941,77.39473684210526,"OK",941,62.733333333333334,"OK",70.064035087719304,"Accepted"]
["MAUVE","Maggy","France","Olympic","F","1999-06-02",19,"Senior",2837,74.65789473684211,"OK",914,60.93333333333333,"OK",67.795614035087723,"Accepted"]
["MENVUSSA","Gérard","France","Olympic","M","1998-09-02",19,"Senior",2625,69.078947368421055,"OK",882,58.8,"To be improved",63.939473684210526,"Not accepted"]
["MISSAOUI","Anane","Algeria","Raja","F","1991-09-04",26,"Senior",2165,56.973684210526315,"To be improved",670,44.666666666666664,"To be improved",50.820175438596493,"Not accepted"]
["MOERS","Serge","Belgium","Atleco","M","1991-04-02",27,"Senior",2853,75.078947368421055,"OK",853,56.866666666666667,"To be improved",65.972807017543857,"Not accepted"]
["MUDA","Albert","France","Olympic","M","1997-07-22",21,"Senior",3554,93.526315789473685,"OK",950,63.333333333333336,"OK",78.429824561403507,"Accepted"]
["NEUSY","Philippe","France","Olympic","M","1998-09-23",19,"Senior",2524,66.421052631578945,"OK",524,34.93333333333333,"To be improved",50.677192982456134,"Not accepted"]
["NGUYEN","Trong-Thao","Korea","Sporteo","M","1994-09-27",23,"Senior",3184,83.78947368421052,"OK",1184,78.933333333333337,"OK",81.361403508771929,"Accepted"]
["NICAISE","Véronique","Switzerland","Sporteo","F","1997-12-29",20,"Senior",3421,90.026315789473685,"OK",1421,94.733333333333334,"OK",92.37982456140351,"Accepted"]
["NONYME","Anne","Belgium","Atleco","F","1993-06-04",25,"Senior",2799,73.65789473684211,"OK",865,57.666666666666664,"To be improved",65.662280701754383,"Not accepted"]
["NOTE","Pia","Italy","Atletico","F","1993-06-23",25,"Senior",3333,87.71052631578948,"OK",1150,76.666666666666671,"OK",82.188596491228083,"Accepted"]
["ORTIZ VALLEJO","Rafaël","Spain","Asturial","M","1997-04-06",21,"Senior",3228,84.94736842105263,"OK",1228,81.86666666666666,"OK",83.407017543859638,"Accepted"]
["OUELD CHAIB","Mohammed","Algeria","Raja","M","1998-12-27",19,"Senior",2423,63.763157894736842,"OK",423,28.2,"To be improved",45.981578947368419,"Not accepted"]
["OURIAGHLI","Hafida","Algeria","Raja","F","1997-10-25",20,"Senior",1917,50.44736842105263,"To be improved",580,38.666666666666664,"To be improved",44.557017543859644,"Not accepted"]
["PAUDE","Anne","Switzerland","Sporteo","F","1999-01-20",19,"Senior",3254,85.631578947368425,"OK",138,9.1999999999999993,"To be improved",47.415789473684214,"Not accepted"]
["PECORARO","Roberto","Italy","Atletico","M","1998-07-12",20,"Senior",2443,64.28947368421052,"OK",443,29.533333333333335,"To be improved",46.911403508771926,"Not accepted"]
["PINCHART","Marc","Belgium","Atleco","M","1999-03-21",19,"Senior",2154,56.684210526315788,"To be improved",154,10.266666666666667,"To be improved",33.47543859649123,"Not accepted"]
["POLLAK","Bernard","France","Olympic","M","1995-06-12",23,"Senior",2142,56.368421052631582,"To be improved",142,9.4666666666666668,"To be improved",32.917543859649122,"Not accepted"]
["PONNEN","Radhakrishnan","France","Sporteo","M","1991-01-13",27,"Senior",2929,77.078947368421055,"OK",929,61.93333333333333,"OK",69.506140350877189,"Accepted"]
["POON","Kwok Shing","Korea","Sporteo","M","1996-11-28",21,"Senior",3051,80.28947368421052,"OK",1051,70.066666666666663,"OK",75.178070175438592,"Accepted"]
["POTE","Jacques","Algeria","Raja","M","1995-11-01",22,"Senior",3688,97.05263157894737,"OK",1075,71.666666666666671,"OK",84.359649122807014,"Accepted"]
["POURCENT","Vincent","France","Olympic","M","1996-06-19",22,"Senior",3710,97.631578947368425,"OK",1076,71.733333333333334,"OK",84.68245614035088,"Accepted"]
["PREVOST","Nathalie","Switzerland","Sporteo","F","1996-11-16",21,"Senior",2535,66.71052631578948,"OK",535,35.666666666666664,"To be improved",51.188596491228068,"Not accepted"]
["PROCHAIN","Edmond","France","Olympic","M","1993-10-18",24,"Senior",3075,80.921052631578945,"OK",1075,71.666666666666671,"OK",76.293859649122808,"Accepted"]
["QUETTING","Marc","Italy","Atletico","M","1997-01-27",21,"Senior",3010,79.21052631578948,"OK",1150,76.666666666666671,"OK",77.938596491228083,"Accepted"]
["RAYA VILCHEZ","Carla","Spain","Asturial","F","1999-06-24",19,"Senior",1941,51.078947368421055,"To be improved",670,44.666666666666664,"To be improved",47.872807017543863,"Not accepted"]
["RIAIRE","Claire","Switzerland","Sporteo","F","1996-08-06",21,"Senior",2035,53.55263157894737,"To be improved",230,15.333333333333334,"To be improved",34.442982456140349,"Not accepted"]
["RINDONE","Giuseppe","Italy","Atletico","M","1994-04-21",24,"Senior",3273,86.131578947368425,"OK",1273,84.86666666666666,"OK",85.499122807017542,"Accepted"]
["RISO","Adriano","Italy","Atletico","M","1999-07-12",19,"Senior",2536,66.736842105263165,"OK",536,35.733333333333334,"To be improved",51.235087719298249,"Not accepted"]
["RONT","Claire","France","Olympic","F","1991-03-18",27,"Senior",3255,85.65789473684211,"OK",677,45.133333333333333,"To be improved",65.395614035087718,"Not accepted"]
["SPLINGART","Pascal","Belgium","Atleco","M","1995-12-08",22,"Senior",2874,75.631578947368425,"OK",874,58.266666666666666,"To be improved",66.949122807017545,"Not accepted"]
["STIQUÉE","Sophie","Belgium","Atleco","F","1991-02-24",{"$f":"YEAR(TODAY()-F98)-1900","v":27},"Senior",3785,99.60526315789474,"OK",715,47.666666666666664,"To be improved",73.635964912280699,"Not accepted"]
["SWERTS","André","Belgium","Atleco","M","1994-11-07",23,"Senior",2154,56.684210526315788,"To be improved",940,62.666666666666664,"OK",59.675438596491226,"New test needed"]
["TATOUILLE","Lara","Belgium","Atleco","F","1996-10-03",21,"Senior",3775,99.34210526315789,"OK",830,55.333333333333336,"To be improved",77.337719298245617,"Not accepted"]
["TERIEUR","Alain","Belgium","Atleco","M","1995-12-25",22,"Senior",3557,93.60526315789474,"OK",441,29.4,"To be improved",61.502631578947373,"Not accepted"]
["TERIEUR","Alex","Switzerland","Sporteo","M","1997-06-04",21,"Senior",2609,68.65789473684211,"OK",933,62.2,"OK",65.428947368421063,"Accepted"]
["THARE","Maggy","France","Olympic","F","1992-08-02",25,"Senior",3701,97.39473684210526,"OK",918,61.2,"OK",79.297368421052624,"Accepted"]
["THELEF","Eric","Switzerland","Sporteo","M","1991-01-04",27,"Senior",3734,98.263157894736835,"OK",1157,77.13333333333334,"OK",87.698245614035088,"Accepted"]
["THON","Dick","Netherlands","Extrasportief","M","1995-02-08",23,"Senior",2053,54.026315789473685,"To be improved",1017,67.8,"OK",60.913157894736841,"New test needed"]
["TORISAEN","Michel","Switzerland","Sporteo","M","1995-07-18",23,"Senior",2431,63.973684210526315,"OK",431,28.733333333333334,"To be improved",46.353508771929825,"Not accepted"]
["VAN BELLE","Philippe","Belgium","Atleco","M","1994-03-15",24,"Senior",1964,51.684210526315788,"To be improved",670,44.666666666666664,"To be improved",48.175438596491226,"Not accepted"]
["VAN DE PUTTE","Michel","Netherlands","Extrasportief","M","1996-07-11",22,"Senior",3232,85.05263157894737,"OK",1232,82.13333333333334,"OK",83.592982456140362,"Accepted"]
["VAN DE WOESTYNE","Gertjan","Netherlands","Extrasportief","M","1993-12-15",24,"Senior",2935,77.236842105263165,"OK",935,62.333333333333336,"OK",69.785087719298247,"Accepted"]
["VAN DEN ENDE","Eefje","Netherlands","Extrasportief","F","1993-10-07",24,"Senior",1929,50.763157894736842,"To be improved",950,63.333333333333336,"OK",57.048245614035089,"New test needed"]
["VAN RO","Michael","Belgium","Atleco","M","1999-10-05",18,"Senior",2130,56.05263157894737,"To be improved",130,8.6666666666666661,"To be improved",32.359649122807021,"Not accepted"]
["VANDAMME","Pascal","Belgium","Atleco","M","1995-10-01",22,"Senior",3074,80.89473684210526,"OK",1074,71.599999999999994,"OK",76.247368421052627,"Accepted"]
["VANDEKERCKHOVE","Saskja","Netherlands","Extrasportief","F","1991-06-21",27,"Senior",3386,89.10526315789474,"OK",1386,92.4,"OK",90.752631578947373,"Accepted"]
["VANDEKERCKOVE","Philippe","Belgium","Atleco","M","1996-04-14",22,"Senior",2676,70.421052631578945,"OK",676,45.06666666666667,"To be improved",57.743859649122811,"Not accepted"]
["VANDROMME","Alain","Belgium","Atleco","M","1994-06-12",24,"Senior",2153,56.657894736842103,"To be improved",750,50,"To be improved",53.328947368421055,"Not accepted"]
["VANTUYKOM","Hilde","Netherlands","Extrasportief","f","1995-01-21",23,"Senior",2885,75.921052631578945,"OK",885,59,"To be improved",67.46052631578948,"Not accepted"]
["VELA HERNANDEZ","José","Spain","Asturial","M","1998-09-11",19,"Senior",3167,83.34210526315789,"OK",1167,77.8,"OK",80.571052631578937,"Accepted"]
["VERDOODT","Karel","Netherlands","Extrasportief","M","1994-11-12",23,"Senior",3216,84.631578947368425,"OK",1216,81.066666666666663,"OK",82.849122807017551,"Accepted"]
["VERHEUGEN","Jean","Belgium","Atleco","M","1999-03-19",19,"Senior",3250,85.526315789473685,"OK",1250,83.333333333333329,"OK",84.429824561403507,"Accepted"]
["VERSTAPPEN","Didier","Belgium","Atleco","M","1994-09-20",23,"Senior",2396,63.05263157894737,"OK",396,26.4,"To be improved",44.726315789473688,"Not accepted"]
["VERSTRAETE","Piet","Netherlands","Extrasportief","M","1992-09-29",25,"Senior",2512,66.10526315789474,"OK",512,34.133333333333333,"To be improved",50.119298245614033,"Not accepted"]
["VERVISCH","Didier","Belgium","Atleco","M","1995-02-23",23,"Senior",2711,71.34210526315789,"OK",711,47.4,"To be improved",59.371052631578948,"Not accepted"]
["VOYANCE","Claire","France","Olympic","F","1996-11-28",21,"Senior",2504,65.89473684210526,"OK",882,58.8,"To be improved",62.347368421052629,"Not accepted"]
["VOYANTE","Claire","Belgium","Atleco","M","1999-08-03",18,"Senior",3318,87.315789473684205,"OK",715,47.666666666666664,"To be improved",67.491228070175438,"Not accepted"]
["WAUQUIER","Françoise","Belgium","Atleco","F","1991-03-10",27,"Senior",3208,84.421052631578945,"OK",1208,80.533333333333331,"OK",82.477192982456131,"Accepted"]
["WIJMMERSCH","Willy","Belgium","Atleco","M","1995-02-10",23,"Senior",2865,75.39473684210526,"OK",865,57.666666666666664,"To be improved",66.530701754385959,"Not accepted"]
["YAHIAOUI","Mohamed","Algeria","Raja","M","1991-09-20",26,"Senior",3075,80.921052631578945,"OK",1075,71.666666666666671,"OK",76.293859649122808,"Accepted"]
["ZIANE","Louis","France","Olympic","M","1999-09-02",18,"Senior",2990,78.684210526315795,"OK",1075,71.666666666666671,"OK",75.175438596491233,"Accepted"]