{"text_format":"1","workbook":"xlsx","n_sheets":5,"sheets":["Introduction","ouv","calculs","dates","arbres"],"not_rendered":{"charts":0,"images":0,"macros":1,"external_links":0,"defined_names":2,"comments":0,"pivot_tables":0},"unopened":[],"bounds":{"document_bytes":16777216,"sheet_cells":100000,"rows_first":2000,"rows_last":500,"rows_between":2000,"halvings":0,"cell_chars":16384,"cell_head_chars":4096},"cells_cut":0,"cells_raw":0,"read":"whole","date_system":"1900"}

{"sheet":"Introduction","index":0,"n_rows":37,"n_cols":4,"rows_kept":37,"cut":false,"hidden":false,"merged":[]}
["Calculer précisément l'âge de quelqu'un est un tâche très ardue"]
["Fonction DATEDIF"]
["La fonction DATEDIF permet de calculer la différence entre deux dates."]
["PRINCIPE DE LA FONCTION DATEDIF"]
["Prenons l’exemple de l’écart en jour entre la date du 28/07/2009 et celle du 05/08/2009."]
["Entre ces 2 dates, il n’y a que 9 jours d’écart et pas un mois complet. Mais il y a eu un basculement d’un mois calendaire."]
["Donc, si nous utilisons la formule suivante, le résultat sera 1 ce qui est complètement faux."]
["2014-07-28","2014-08-05",{"$f":"MONTH(B8)-MONTH(A8)","v":1},"=MOIS(B8)-MOIS(A8)"]
[]
["Comme l’exemple l’a démontré, une différence entre 2 dates n’est pas un calcul facile."]
["Mais bien un calcul qui est très compliqué."]
["Et tout d’abord quel type de différence voulons-nous calculer ?  Une différence sur les mois, sur les jours, sur les années ou à partir d’une année pleine ?"]
["Pour réaliser ces calculs, Excel possède une fonction incroyable pour réaliser les différences entre les dates mais cette fonction est cachée et n'est plus documentée depuis des années"]
["Pour vous en rendre compte, il vous suffit d’afficher l’aide en ligne sur cette fonction et vous verrez que rien (absolument rien) ne s’affiche à propos de la fonction DATEDIF"]
["Et pourtant elle fonctionne  parfaitement."]
["LA FONCTION"]
["Cette fonction a besoin de 3 paramètres pour fonctionner"]
["Une date, une seconde date (nécessairement supérieure à la première date) et un paramètre pour retourner l’écart."]
[]
["Date de naissance",null,"1966-03-24"]
{"$rows_left_out":18}
{"sheet":"ouv","index":1,"n_rows":22,"n_cols":6,"rows_kept":22,"cut":false,"hidden":false,"merged":[[21,4,25,7],[1,1,3,5],[5,1,7,4],[7,5,7,6],[14,1,19,8],[9,1,12,6],[6,5,6,6]]}
[]
[null,"Chacun sait que tout être humain descend de l'arbre, mais duquel exactement ?"]
[]
[]
[]
[null,"Si vous souhaitez le savoir, entrez votre date de naissance :…………………………."]
[null,null,null,null,null,"jj-mm-aaaa"]
[null,null,null,null,null,"1966-03-24"]
[]
[null,{"$f":"calculs!C5","v":"Né(e) sous le signe du Bélier il y a 51 ans 0 mois 13 jours vous descendez du Noisetier "}]
[]
[]
[]
[]
[null,{"$f":"calculs!C8","v":"NOISETIER (l'extraordinaire) - Charmant, peu exigeant, très compréhensif, sait comment faire bonne impression, ardent défenseur des causes sociales, populaire, d'humeur changeante, est un amant capricieux, honnête, un partenaire tolérant, possède un sens précis du jugement"}]
[]
[]
[]
[]
[]
{"$rows_left_out":3}
{"sheet":"calculs","index":2,"n_rows":30,"n_cols":5,"rows_kept":30,"cut":false,"hidden":false,"merged":[]}
[null,null,{"$f":"DAY(ouv!F8)","v":24}]
[null,null,{"$f":"MONTH(ouv!F8)","v":3}]
[null,null,{"$f":"C1&C2","v":"243"}]
[]
[null,null,{"$f":"IF(ouv!F8=0,\"\",IF(ISNUMBER(ouv!F8),\"Né(e) sous le signe \"&VLOOKUP(C3,dates!C1:G365,5)&\" il y a \"&C14&\" vous descendez \"&VLOOKUP(C3,dates!C1:F365,3),\"La date doit être égale ou supérieure au            1 er janvier 1900\"))","v":"Né(e) sous le signe du Bélier il y a 51 ans 0 mois 13 jours vous descendez du Noisetier "}]
[]
[]
[null,null,{"$f":"IF(ISNUMBER(ouv!F8),VLOOKUP(C3,dates!C1:F365,4),\"\")","v":"NOISETIER (l'extraordinaire) - Charmant, peu exigeant, très compréhensif, sait comment faire bonne impression, ardent défenseur des causes sociales, populaire, d'humeur changeante, est un amant capricieux, honnête, un partenaire tolérant, possède un sens précis du jugement"}]
[]
[]
[null,null,{"$f":"IF(ISNUMBER(ouv!F8),\"Alors, si nous voulons que le cycle continue, protégeons nos arbres.\",\"\")","v":"Alors, si nous voulons que le cycle continue, protégeons nos arbres."}]
[]
[]
[null,null,{"$f":"DATEDIF(ouv!F8,TODAY(),\"y\")&\" ans \"&DATEDIF(ouv!F8,TODAY(),\"ym\")&\" mois \"&DATEDIF(ouv!F8,TODAY(),\"md\")&\" jours\"","v":"51 ans 0 mois 13 jours"}]
[]
[]
[]
[]
[]
[]
{"$rows_left_out":11}
{"sheet":"dates","index":3,"n_rows":365,"n_cols":8,"rows_kept":365,"cut":false,"hidden":false,"merged":[]}
[{"$f":"DAY(D1)","v":10},{"$f":"MONTH(D1)","v":1},{"$f":"A1&B1","v":"101"},"2003-01-10","du Sapin ",{"$f":"VLOOKUP(H1,arbres!$A$1:$B$21,2)","v":"SAPIN (le mystérieux) - Fait preuve d'un goût extraordinaire, est digne, sophistique, adore tout ce qui est beau, est d'humeur changeante, entêté, a une tendance à l'égoïsme, mais est attentif aux personnes qui sont proches de lui, est plutôt modeste, très ambitieux, talentueux, travailleur, un amant insatisfait, a plusieurs amis, plusieurs ennemis, on peut compter sur lui"},"du Capricorne","Sapin"]
[{"$f":"DAY(D2)","v":10},{"$f":"MONTH(D2)","v":10},{"$f":"A2&B2","v":"1010"},"2003-10-10","du Cormier ",{"$f":"VLOOKUP(H2,arbres!$A$1:$B$21,2)","v":"CORMIER (la délicatesse) - Plein de charme, enjoué, talentueux sans être égoïste aime attirer l'attention, adore la vie, le mouvement, l'agitation et même les complications, est à la fois dépendant et indépendant, fait preuve de bon goût, est artistique, passionné, émotif, est de bonne compagnie, mais ne pardonne pas"},"de la Balance","Cormier"]
[10,11,"1011","2003-11-10","du Noyer ",{"$f":"VLOOKUP(H3,arbres!$A$1:$B$21,2)","v":"NOYER (la passion) - Implacable, surprenant et plein de contrastes, souvent narcissique, peut démontrer de l'agressivité, est généreux, de vastes horizons s'ouvrent à lui, peut avoir des réactions inattendues, est spontané, fait preuve d'une ambition sans limite, aucune flexibilité, est un partenaire difficile et peu commun, n'est pas toujours aimé mais est souvent admire, stratège hors pair, très jaloux et passionné, ne fait aucun compromis"},"du Scorpion","Noyer"]
[10,12,"1012","2003-12-10","du Charme de la Caroline ",{"$f":"VLOOKUP(H4,arbres!$A$1:$B$21,2)","v":"CHARME DE LA CAROLINE (le bon goût) - D'une beauté affranchissante, fait attention à son apparence et à sa condition physique, fait preuve de bon goût, n'est pas égoïste, fait en sorte que sa vie soit aussi confortable que possible, mène une vie raisonnable et disciplinée, recherche la gentillesse et la reconnaissance chez un partenaire de vie, rêve d'amants exceptionnels, est quelquefois heureux de ses sentiments, a peu confiance dans la plupart des gens, n'est jamais certain de ses décisions, est très consciencieux."},"du Sagitaire","Charme de la Caroline"]
[10,2,"102","2003-02-10","du Cèdre ",{"$f":"VLOOKUP(H5,arbres!$A$1:$B$21,2)","v":"CEDRE (la confiance) - D'une rare beauté, sait s'adapter, aime le luxe, jouit d'une bonne santé, loin d'être timide, a tendance à regarder les autres de haut, est sur de lui, déterminé, impatient, aime impressionner les autres, a de nombreux talents, travailleur, d'un optimisme sain, attendra son seul vrai amour, et est capable de prendre des décisions rapidement."},"du Verseau","Cèdre"]
[10,3,"103","2003-03-10","du Saule pleureur ",{"$f":"VLOOKUP(H6,arbres!$A$1:$B$21,2)","v":"SAULE PLEUREUR (la mélancolie) - Beau mais plein de mélancolie, séduisant, très emphatique, aime tout ce qui est beau et de bon goût, aime voyager, est rêveur, agité, capricieux, honnête, peut être influencé mais il n'est pas facile à vivre, exigeant, bonne intuition, souffre en amour mais trouve quelquefois un partenaire qui lui sert de point d'ancrage"},"des Poissons","Saule pleureur"]
[10,4,"104","2003-04-10","du Cormier ",{"$f":"VLOOKUP(H7,arbres!$A$1:$B$21,2)","v":"CORMIER (la délicatesse) - Plein de charme, enjoué, talentueux sans être égoïste aime attirer l'attention, adore la vie, le mouvement, l'agitation et même les complications, est à la fois dépendant et indépendant, fait preuve de bon goût, est artistique, passionné, émotif, est de bonne compagnie, mais ne pardonne pas"},"du Bélier","Cormier"]
[10,5,"105","2003-05-10","du Peuplier ",{"$f":"VLOOKUP(H8,arbres!$A$1:$B$21,2)","v":"PEUPLIER (l'incertitude) - Très décoratif, n'a pas beaucoup confiance en lui, courageux seulement lorsque nécessaire, a besoin d'être entouré de personnes plaisantes et de bonne volonté, très sélectif, souvent solitaire, peut éprouver une grande animosité, possède une nature artistique, est un organisateur, a un penchant pour la philosophie, fiable dans toutes les situations, le couple est très important pour lui"},"du Taureau","Peuplier "]
[10,6,"106","2003-06-10","du Charme de la Caroline ",{"$f":"VLOOKUP(H9,arbres!$A$1:$B$21,2)","v":"CHARME DE LA CAROLINE (le bon goût) - D'une beauté affranchissante, fait attention à son apparence et à sa condition physique, fait preuve de bon goût, n'est pas égoïste, fait en sorte que sa vie soit aussi confortable que possible, mène une vie raisonnable et disciplinée, recherche la gentillesse et la reconnaissance chez un partenaire de vie, rêve d'amants exceptionnels, est quelquefois heureux de ses sentiments, a peu confiance dans la plupart des gens, n'est jamais certain de ses décisions, est très consciencieux."},"des Gémeaux","Charme de la Caroline"]
[10,7,"107","2003-07-10","du du Sapin ",{"$f":"VLOOKUP(H10,arbres!$A$1:$B$21,2)","v":"SAPIN (le mystérieux) - Fait preuve d'un goût extraordinaire, est digne, sophistique, adore tout ce qui est beau, est d'humeur changeante, entêté, a une tendance à l'égoïsme, mais est attentif aux personnes qui sont proches de lui, est plutôt modeste, très ambitieux, talentueux, travailleur, un amant insatisfait, a plusieurs amis, plusieurs ennemis, on peut compter sur lui"},"du Cancer","Sapin"]
[10,8,"108","2003-08-10","du Peuplier ",{"$f":"VLOOKUP(H11,arbres!$A$1:$B$21,2)","v":"PEUPLIER (l'incertitude) - Très décoratif, n'a pas beaucoup confiance en lui, courageux seulement lorsque nécessaire, a besoin d'être entouré de personnes plaisantes et de bonne volonté, très sélectif, souvent solitaire, peut éprouver une grande animosité, possède une nature artistique, est un organisateur, a un penchant pour la philosophie, fiable dans toutes les situations, le couple est très important pour lui"},"du Lion","Peuplier "]
[10,9,"109","2003-09-10","du Saule pleureur ",{"$f":"VLOOKUP(H12,arbres!$A$1:$B$21,2)","v":"SAULE PLEUREUR (la mélancolie) - Beau mais plein de mélancolie, séduisant, très emphatique, aime tout ce qui est beau et de bon goût, aime voyager, est rêveur, agité, capricieux, honnête, peut être influencé mais il n'est pas facile à vivre, exigeant, bonne intuition, souffre en amour mais trouve quelquefois un partenaire qui lui sert de point d'ancrage"},"de la Vierge","Saule pleureur"]
[{"$f":"DAY(D13)","v":1},{"$f":"MONTH(D13)","v":1},{"$f":"A13&B13","v":"11"},"2003-01-01","du Pommier ",{"$f":"VLOOKUP(H13,arbres!$A$1:$B$21,2)","v":"POMMIER (l'amour) - Frêle possède beaucoup de charme, a un bon pouvoir de séduction et d'attraction, a une aura plaisante, aime flirter, est aventureux, sensible, toujours en amour, veut aimer et être aimé, partenaire tendre et fidèle, est très généreux, a des talents scientifiques, ne vit que pour aujourd'hui, est un philosophe insouciant et imaginatif"},"du Capricorne","Pommier "]
[1,10,"110","2003-10-01","du Noisetier ",{"$f":"VLOOKUP(H14,arbres!$A$1:$B$21,2)","v":"NOISETIER (l'extraordinaire) - Charmant, peu exigeant, très compréhensif, sait comment faire bonne impression, ardent défenseur des causes sociales, populaire, d'humeur changeante, est un amant capricieux, honnête, un partenaire tolérant, possède un sens précis du jugement"},"de la Balance","Noisetier"]
[11,1,"111","2003-01-11","du Sapin ",{"$f":"VLOOKUP(H15,arbres!$A$1:$B$21,2)","v":"SAPIN (le mystérieux) - Fait preuve d'un goût extraordinaire, est digne, sophistique, adore tout ce qui est beau, est d'humeur changeante, entêté, a une tendance à l'égoïsme, mais est attentif aux personnes qui sont proches de lui, est plutôt modeste, très ambitieux, talentueux, travailleur, un amant insatisfait, a plusieurs amis, plusieurs ennemis, on peut compter sur lui"},"du Capricorne","Sapin"]
[1,11,"111","2003-11-01","du Noyer ",{"$f":"VLOOKUP(H16,arbres!$A$1:$B$21,2)","v":"NOYER (la passion) - Implacable, surprenant et plein de contrastes, souvent narcissique, peut démontrer de l'agressivité, est généreux, de vastes horizons s'ouvrent à lui, peut avoir des réactions inattendues, est spontané, fait preuve d'une ambition sans limite, aucune flexibilité, est un partenaire difficile et peu commun, n'est pas toujours aimé mais est souvent admire, stratège hors pair, très jaloux et passionné, ne fait aucun compromis"},"du Scorpion","Noyer"]
[11,10,"1110","2003-10-11","du Cormier ",{"$f":"VLOOKUP(H17,arbres!$A$1:$B$21,2)","v":"CORMIER (la délicatesse) - Plein de charme, enjoué, talentueux sans être égoïste aime attirer l'attention, adore la vie, le mouvement, l'agitation et même les complications, est à la fois dépendant et indépendant, fait preuve de bon goût, est artistique, passionné, émotif, est de bonne compagnie, mais ne pardonne pas"},"de la Balance","Cormier"]
[11,11,"1111","2003-11-11","du Noyer ",{"$f":"VLOOKUP(H18,arbres!$A$1:$B$21,2)","v":"NOYER (la passion) - Implacable, surprenant et plein de contrastes, souvent narcissique, peut démontrer de l'agressivité, est généreux, de vastes horizons s'ouvrent à lui, peut avoir des réactions inattendues, est spontané, fait preuve d'une ambition sans limite, aucune flexibilité, est un partenaire difficile et peu commun, n'est pas toujours aimé mais est souvent admire, stratège hors pair, très jaloux et passionné, ne fait aucun compromis"},"du Scorpion","Noyer"]
[11,12,"1112","2003-12-11","du Charme de la Caroline ",{"$f":"VLOOKUP(H19,arbres!$A$1:$B$21,2)","v":"CHARME DE LA CAROLINE (le bon goût) - D'une beauté affranchissante, fait attention à son apparence et à sa condition physique, fait preuve de bon goût, n'est pas égoïste, fait en sorte que sa vie soit aussi confortable que possible, mène une vie raisonnable et disciplinée, recherche la gentillesse et la reconnaissance chez un partenaire de vie, rêve d'amants exceptionnels, est quelquefois heureux de ses sentiments, a peu confiance dans la plupart des gens, n'est jamais certain de ses décisions, est très consciencieux."},"du Sagitaire","Charme de la Caroline"]
[11,2,"112","2003-02-11","du Cèdre ",{"$f":"VLOOKUP(H20,arbres!$A$1:$B$21,2)","v":"CEDRE (la confiance) - D'une rare beauté, sait s'adapter, aime le luxe, jouit d'une bonne santé, loin d'être timide, a tendance à regarder les autres de haut, est sur de lui, déterminé, impatient, aime impressionner les autres, a de nombreux talents, travailleur, d'un optimisme sain, attendra son seul vrai amour, et est capable de prendre des décisions rapidement."},"du Verseau","Cèdre"]
{"$rows_left_out":346}
{"sheet":"arbres","index":4,"n_rows":21,"n_cols":2,"rows_kept":21,"cut":false,"hidden":false,"merged":[]}
["BOULEAU","BOULEAU (l'inspiration) - enjoué, séduisant, élégant, amical, sans prétention, modeste, n'aime pas les excès, a en horreur la vulgarité, aime la vie dans la nature et le calme, n'est pas très passionné, regorge d'imagination, a peu d'ambition, créé une atmosphère calme et satisfaisante."]
["CEDRE","CEDRE (la confiance) - D'une rare beauté, sait s'adapter, aime le luxe, jouit d'une bonne santé, loin d'être timide, a tendance à regarder les autres de haut, est sur de lui, déterminé, impatient, aime impressionner les autres, a de nombreux talents, travailleur, d'un optimisme sain, attendra son seul vrai amour, et est capable de prendre des décisions rapidement."]
["CHARME DE LA CAROLINE","CHARME DE LA CAROLINE (le bon goût) - D'une beauté affranchissante, fait attention à son apparence et à sa condition physique, fait preuve de bon goût, n'est pas égoïste, fait en sorte que sa vie soit aussi confortable que possible, mène une vie raisonnable et disciplinée, recherche la gentillesse et la reconnaissance chez un partenaire de vie, rêve d'amants exceptionnels, est quelquefois heureux de ses sentiments, a peu confiance dans la plupart des gens, n'est jamais certain de ses décisions, est très consciencieux."]
["CHATAIGNIER","CHATAIGNIER (l'honnêteté) - D'une beauté peu commune, ne veut pas impressionner, a un sens de la justice très développé, peu diplomate, s'irrite facilement et est souvent blessé en société en raison de son manque d'estime de lui, quelquefois donne l'impression d'être supérieur, a l'impression de ne pas être compris, n'aime qu'une fois, peut avoir des difficultés à trouver un partenaire. "]
["CHENE","CHENE (le brave) - De nature robuste, courageux, fort, implacable, indépendant, raisonnable, n'aime pas le changement, aime garder les pieds sur terre, est une personne d'action"]
["CORMIER","CORMIER (la délicatesse) - Plein de charme, enjoué, talentueux sans être égoïste aime attirer l'attention, adore la vie, le mouvement, l'agitation et même les complications, est à la fois dépendant et indépendant, fait preuve de bon goût, est artistique, passionné, émotif, est de bonne compagnie, mais ne pardonne pas"]
["CYPRES","CYPRES (la fidélité) - Fort, musclé, adaptable, prend ce que la vie a à offrir, content, optimiste, a soif d'argent et de reconnaissance, déteste la solitude, amant passionné qui ne peut être satisfait, est fidèle, s'emporte facilement, est indiscipliné, pendant et négligent."]
["ÉRABLE","ÉRABLE (l'indépendance d'esprit) - Sort de l'ordinaire, débordant d'imagination et d'originalité, timide et réservé, ambitieux, fier, sûr de lui, désire ardemment vivre de nouvelles expériences, est quelquefois nerveux, possède plusieurs complexités, a une bonne mémoire, apprend facilement, a une vie amoureuse compliquée, désire impressionner."]
["FIGUIER","FIGUIER (la sensibilité) - Très fort, un peu entêté, indépendant, ne tolère pas les contradictions ou les controverses, adore la vie, sa famille, les enfants et  les animaux, un peu volage en société, a un bon sens de l'humour, aime l'oisiveté et la paresse, possède des talents et une intelligence pratiques."]
["FRENE","FRENE (l'ambition) - Très séduisant, vif, impulsif, exigeant, ne se préoccupe pas des critiques, ambitieux, intelligent, talentueux, aime jouer avec le destin, peut être narcissique, très fiable et digne de confiance, amant fidèle et prudent, laisse quelquefois sa tête avoir le pas sur son cœur, mais prend le couple très au sérieux."]
["HETRE","HETRE (le créatif) - Fait preuve de bon goût, s'inquiète de son apparence, matérialiste, démontre un bon sens de l'organisation en ce qui concerne sa vie et sa carrière, est économe, bon dirigeant, raisonnable, ne prend pas de risques inutiles, excellent compagnon de vie, se passionne pour tout ce qui permet de garder la forme (diètes, sports, etc...)."]
["NOISETIER","NOISETIER (l'extraordinaire) - Charmant, peu exigeant, très compréhensif, sait comment faire bonne impression, ardent défenseur des causes sociales, populaire, d'humeur changeante, est un amant capricieux, honnête, un partenaire tolérant, possède un sens précis du jugement"]
["NOYER","NOYER (la passion) - Implacable, surprenant et plein de contrastes, souvent narcissique, peut démontrer de l'agressivité, est généreux, de vastes horizons s'ouvrent à lui, peut avoir des réactions inattendues, est spontané, fait preuve d'une ambition sans limite, aucune flexibilité, est un partenaire difficile et peu commun, n'est pas toujours aimé mais est souvent admire, stratège hors pair, très jaloux et passionné, ne fait aucun compromis"]
["OLIVIER","OLIVIER (la sagesse) - Aime le soleil, la chaleur et les doux sentiments, équilibré, évite les agressions et la violence, tolérant, enjoué, calme, possède un sens de la justice bien développé, sensible, emphatique, n'éprouve pas de jalousie, aime lire et aime être entouré de gens sophistiqués"]
["ORME","ORME (la générosité) - De forme plaisante, porte des vêtements élégants, a des exigences modestes, a tendance à ne pas pardonner les erreurs, enjoué, aime mener mais n'aime pas obéir, partenaire fidèle, aime prendre des décisions pour les autres, généreux, a un bon sens de l'humour, est pratique"]
["PEUPLIER","PEUPLIER (l'incertitude) - Très décoratif, n'a pas beaucoup confiance en lui, courageux seulement lorsque nécessaire, a besoin d'être entouré de personnes plaisantes et de bonne volonté, très sélectif, souvent solitaire, peut éprouver une grande animosité, possède une nature artistique, est un organisateur, a un penchant pour la philosophie, fiable dans toutes les situations, le couple est très important pour lui"]
["PIN","PIN (le particulier) - Adore être entouré de gens agréables, très robuste, sait comment rendre la vie confortable, est très actif, naturel, un bon compagnon, rarement amical, devient facilement amoureux, mais sa passion s'éteint vite, renonce facilement, tout est matière aux déceptions jusqu'à ce qu'il rencontre son idéal, est digne de confiance et pratique"]
["POMMIER","POMMIER (l'amour) - Frêle possède beaucoup de charme, a un bon pouvoir de séduction et d'attraction, a une aura plaisante, aime flirter, est aventureux, sensible, toujours en amour, veut aimer et être aimé, partenaire tendre et fidèle, est très généreux, a des talents scientifiques, ne vit que pour aujourd'hui, est un philosophe insouciant et imaginatif"]
["SAPIN","SAPIN (le mystérieux) - Fait preuve d'un goût extraordinaire, est digne, sophistique, adore tout ce qui est beau, est d'humeur changeante, entêté, a une tendance à l'égoïsme, mais est attentif aux personnes qui sont proches de lui, est plutôt modeste, très ambitieux, talentueux, travailleur, un amant insatisfait, a plusieurs amis, plusieurs ennemis, on peut compter sur lui"]
["SAULE PLEUREUR","SAULE PLEUREUR (la mélancolie) - Beau mais plein de mélancolie, séduisant, très emphatique, aime tout ce qui est beau et de bon goût, aime voyager, est rêveur, agité, capricieux, honnête, peut être influencé mais il n'est pas facile à vivre, exigeant, bonne intuition, souffre en amour mais trouve quelquefois un partenaire qui lui sert de point d'ancrage"]
{"$rows_left_out":1}